{"text_format":"1","workbook":"xlsx","n_sheets":4,"sheets":["Elolap","Tamogatastartalom","Szamitasok","Adatok"],"not_rendered":{"charts":0,"images":0,"macros":0,"external_links":0,"defined_names":58,"comments":1,"pivot_tables":0},"unopened":[],"bounds":{"document_bytes":16777216,"sheet_cells":100000,"rows_first":2000,"rows_last":500,"rows_between":2000,"halvings":0,"cell_chars":16384,"cell_head_chars":4096},"cells_cut":0,"cells_raw":0,"read":"whole","date_system":"1900"}

{"sheet":"Elolap","index":0,"n_rows":0,"n_cols":0,"rows_kept":0,"cut":false,"hidden":false,"merged":[]}

{"sheet":"Tamogatastartalom","index":1,"n_rows":126,"n_cols":47,"rows_kept":126,"cut":false,"hidden":false,"merged":[[0,19,1,20],[0,11,1,12],[3,1,3,2],[6,5,6,8],[5,1,5,2],[2,46,3,46],[3,4,4,4],[2,19,3,19],[2,20,3,20],[2,43,2,44],[2,39,2,41],[2,21,2,24],[2,26,2,30],[2,36,2,38],[2,11,3,11],[2,12,3,12],[2,5,2,7],[3,5,3,7],[4,5,4,7]]}
[null,null,null,null,null,null,null,null,null,null,null,{"$f":"IF(SUM(M7:M126)<C24,\"A folyósítások összege kevesebb, mint a hitelösszeg\",\"A folyósítások összege több, mint a hitelösszeg\")","v":"A folyósítások összege kevesebb, mint a hitelösszeg"},null,null,null,null,null,null,null,{"$f":"IF(SUM(U7:U126)<C24,\"A törlesztések összege kevesebb, mint a hitelösszeg\",\"A törlesztések összege több, mint a hitelösszeg\")","v":"A törlesztések összege kevesebb, mint a hitelösszeg"}]
[]
[null,"Ügyfél neve: ",null,null,null,"Hitelösszeg (EUR)",null,null,{"$f":"IF(C9=\"HUF\",C24/C10,C24)","v":277777.77777777775},null,null,"Egyedi folyósítás dátuma","Folyósítás összege",null,null,null,null,null,null,"Egyedi törlesztés dátuma","Tőkeamortizáció egyedi törlesztés esetén","periódusközi kamatszámítás",null,null,null,null,"maradék kamatszámítás",null,null,null,null,null,null,null,null,null,"Piaci konstrukció",null,null,"Támogatott konstruckió",null,null,null,"Támogatástartalom",null,null,"Támogatástartalom + egyéb kedvezmények"]
[null,null,null,-0.04,null,{"$f":"IF(tenylegestt=0,\"Az ügylet nem finanszírozható\",\"Ténylegesen felvett hitel támogatástartalma (EUR)\")","v":"Ténylegesen felvett hitel támogatástartalma (EUR)"},null,null,{"$f":"IF(C9=\"HUF\",AR5/C10,AR5)","v":167447.72727272761},null,null,null,null,null,null,"kamat","támogatott",null,null,null,null,"dátumtól","tőke","kamat","támogatott",null,"dátumtól","amort","tőke","maradék","t maradék",null,null,null,"Periodus","Dátum","Tőke","Tőkeamt.","Kamatfiz.","Tőke","Tőkeamt.","Kamatfiz.",null,"FV","PV"]
[null,"Pénzügyi intézmény neve refinanszírozás esetén: ",null,null,null,"Hitelösszeg (HUF)",null,null,{"$f":"I3*C10","v":99999999.999999985},null,null,null,null,null,null,{"$f":"SUM(P7:P126)","v":-11938356.16438356},{"$f":"SUM(Q7:Q126)","v":-1438356.1643835616},null,null,null,null,null,null,{"$f":"SUM(X7:X126)","v":0},{"$f":"SUM(Y7:Y126)","v":0},null,null,null,null,{"$f":"SUM(AD7:AD126)","v":-68538877.957658961},{"$f":"SUM(AE7:AE126)","v":-8257696.1394769782},null,null,null,null,null,{"$f":"+AK7","v":100000000},{"$f":"SUM(AL7:AL126)","v":-99999999.999999821},{"$f":"SUM(AM7:AM126)","v":-68538877.957658961},{"$f":"+AN7","v":100000000},{"$f":"SUM(AO7:AO126)","v":-99999999.999999821},{"$f":"SUM(AP7:AP126)","v":-8257696.1394769782},null,{"$f":"SUM(AR7:AR126)","v":60281181.818181939},{"$f":"SUM(AS7:AS126)","v":53541098.626744486},null,{"$f":"AS5","v":53541098.626744486}]
[null,null,null,null,null,null,null,null,null,"Törlesztésiidőszak vége?",null,null,null,null,null,null,null,null,null,null,null,null,null,null,null,null,null,null,null,null,null,null,null,null,0,{"$f":"MAX(C26,MIN(L7:L126))","v":"2020-05-30"}]
[null,null,null,null,null,"COVID Közlemény 3.1 alapján megítélt támogatásokon felül igénybe vehető szabad keret",null,null,null,{"$f":"AI7>$D$15","v":false},null,null,null,{"$f":"C26","v":"2020-05-30"},{"$f":"IF(ISBLANK(L7),C24,0)","v":100000000},{"$f":"IF(AND(ISBLANK(L6),AH7<>1),0,IFERROR(-O7*piacikamat/365*(IF(ISBLANK(L7),$C$27,L7)-N7),\"\"))","v":-11938356.16438356},{"$f":"IF(AND(ISBLANK(L6),AH7<>1),0,IFERROR(-O7*tenylegeskamat/365*(IF(ISBLANK(L7),$C$27,L7)-N7),\"\"))","v":-1438356.1643835616},{"$f":"IFERROR(IF(ISBLANK(L7),$C$27,L7)-N7,\"\")","v":350},null,null,null,{"$f":"IF(ISNA(MAX(T6,INDEX(AJ$6:AJ$126,MATCH(T7-1,AJ$6:AJ$126,1)))),\"\",MAX(T6,INDEX(AJ$6:AJ$126,MATCH(T7-1,AJ$6:AJ$126,1))))","v":""},{"$f":"IF(ISNA(MIN(IF(OR(ISBLANK(W6),W6=\"\"),INDEX(AK$7:AK$126,MATCH(T7,AJ$7:AJ$126,1)),W6-U6),INDEX(AK$7:AK$126,MATCH(T7,AJ$7:AJ$126,1)))),\"\",MIN(IF(OR(ISBLANK(W6),W6=\"\"),INDEX(AK$7:AK$126,MATCH(T7,AJ$7:AJ$126,1)),W6-U6),INDEX(AK$7:AK$126,MATCH(T7,AJ$7:AJ$126,1))))","v":""},{"$f":"IFERROR(-W7*piacikamat/365*(T7-V7),\"\")","v":""},{"$f":"IFERROR(-W7*tenylegeskamat/365*(T7-V7),\"\")","v":""},{"$f":"IFERROR(T7-V7,\"\")","v":""},{"$f":"MAX(AJ6,IF(ISNA(INDEX(T$7:T$126,MATCH(AJ7,T$7:T$126,1))),0,INDEX(T$7:T$126,MATCH(AJ7,T$7:T$126,1))))","v":"2020-05-30"},{"$f":"IF(ISNA(INDEX(U$7:U$126,MATCH(AJ7,T$7:T$126,1))),0,INDEX(U$7:U$126,MATCH(AJ7,T$7:T$126,1)))","v":0},{"$f":"IF(ISNA(INDEX(W$7:W$126,MATCH(AJ7,T$7:T$126,1))),AK7,INDEX(W$7:W$126,MATCH(AJ7,T$7:T$126,1)))","v":100000000},{"$f":"IFERROR(-(AC7-AB7)*piacikamat/365*(AJ7-AA7),0)","v":-11938356.16438356},{"$f":"IFERROR(-(AC7-AB7)*tenylegeskamat/365*(AJ7-AA7),0)","v":-1438356.1643835616},{"$f":"IFERROR(AJ7-AA7,\"\")","v":350},null,1,{"$f":"+IF(C28-C27<>0,1,\"\")","v":1},{"$f":"C27","v":"2021-05-15"},{"$f":"IF(+C24<>0,C24,IF(AI7>0,C24*J7,\"\"))","v":100000000},{"$f":"IF(torlesztes=\"Egyedi\",-SUMIFS(U$7:U$126,T$7:T$126,\">\"&AJ6,T$7:T$126,\"<=\"&AJ7),IFERROR(IF(torlesztes=\"Egyenlő tőke\",IF(COUNT($AK$7:AK7)>$D$15,\"\",-$AK$5/$D$15),0),\"\"))","v":-909090.90909090906},{"$f":"SUM(P7:P126)","v":-11938356.16438356},{"$f":"+AK7","v":100000000},{"$f":"IF(torlesztes=\"Egyedi\",-SUMIFS(U$7:U$126,T$7:T$126,\">\"&AJ6,T$7:T$126,\"<=\"&AJ7),IFERROR(IF(torlesztes=\"Egyenlő tőke\",IF(COUNT($AN$7:AN7)>$D$15,\"\",-$AK$5/$D$15),0),\"\"))","v":-909090.90909090906},{"$f":"SUM(Q7:Q126)","v":-1438356.1643835616},null,{"$f":"IFERROR(MAX((ABS(AM7)-ABS(AP7)),0),\"\")","v":10499999.999999998},{"$f":"IFERROR(AR7/(1+($C$11+1%)/365*(AJ7-C25)),\"\")","v":10149830.836152729},{"$f":"IFERROR(AJ7-AJ6,\"\")","v":350}]
[null,"PIACI KAMAT MEGHATÁROZÁSA",null,null,null,null,"Általános szabály","Mezőgazdasági szabály","Halászati szabály",{"$f":"AI8>$D$15","v":false},null,null,null,{"$f":"IF(ISBLANK(L7),\"\",L7)","v":""},{"$f":"IF(ISBLANK(L7),0,M7+O7)","v":0},0,0,"",null,null,null,{"$f":"IF(ISNA(MAX(T7,INDEX(AJ$6:AJ$126,MATCH(T8-1,AJ$6:AJ$126,1)))),\"\",MAX(T7,INDEX(AJ$6:AJ$126,MATCH(T8-1,AJ$6:AJ$126,1))))","v":""},{"$f":"IF(ISNA(MIN(IF(OR(ISBLANK(W7),W7=\"\"),INDEX(AK$7:AK$126,MATCH(T8,AJ$7:AJ$126,1)),W7-U7),INDEX(AK$7:AK$126,MATCH(T8,AJ$7:AJ$126,1)))),\"\",MIN(IF(OR(ISBLANK(W7),W7=\"\"),INDEX(AK$7:AK$126,MATCH(T8,AJ$7:AJ$126,1)),W7-U7),INDEX(AK$7:AK$126,MATCH(T8,AJ$7:AJ$126,1))))","v":""},"","","",{"$f":"MAX(AJ7,IF(ISNA(INDEX(T$7:T$126,MATCH(AJ8,T$7:T$126,1))),0,INDEX(T$7:T$126,MATCH(AJ8,T$7:T$126,1))))","v":"2021-05-15"},{"$f":"IF(ISNA(INDEX(U$7:U$126,MATCH(AJ8,T$7:T$126,1))),0,INDEX(U$7:U$126,MATCH(AJ8,T$7:T$126,1)))","v":0},{"$f":"IF(ISNA(INDEX(W$7:W$126,MATCH(AJ8,T$7:T$126,1))),AK8,INDEX(W$7:W$126,MATCH(AJ8,T$7:T$126,1)))","v":99090909.090909094},-1047784.5579078455,-126239.10336239102,31,null,2,{"$f":"IF(COUNT(AJ8)=1,AI7+1,\"\")","v":2},{"$f":"IF(OR(AJ7=$C$28,AJ7=\"\"),\"\",IFERROR(IF(EDATE($C$27,(AH8-1)*12/$D$19)<=$C$28,EDATE($C$27,(AH8-1)*12/$D$19),$C$28),\"\"))","v":"2021-06-15"},{"$f":"+IF(COUNT(AK7)<>0,SUM(AK7:AL7)*(1-J8),\"\")","v":99090909.090909094},{"$f":"IF(torlesztes=\"Egyedi\",-SUMIFS(U$7:U$126,T$7:T$126,\">\"&AJ7,T$7:T$126,\"<=\"&AJ8),IFERROR(IF(torlesztes=\"Egyenlő tőke\",IF(COUNT($AK$7:AK8)>$D$15,\"\",-$AK$5/$D$15),0),\"\"))","v":-909090.90909090906},{"$f":"IF(torlesztes=\"Egyedi\",SUMIFS(X$7:X$126,T$7:T$126,\">\"&AJ7,T$7:T$126,\"<=\"&AJ8)+AD8,IFERROR(-AK8*piacikamat/365*(AJ8-AJ7),\"\"))","v":-1047784.5579078455},{"$f":"+IF(COUNT(AN7)<>0,SUM(AN7:AO7)*(1-J8),\"\")","v":99090909.090909094},{"$f":"IF(torlesztes=\"Egyedi\",-SUMIFS(U$7:U$126,T$7:T$126,\">\"&AJ7,T$7:T$126,\"<=\"&AJ8),IFERROR(IF(torlesztes=\"Egyenlő tőke\",IF(COUNT($AN$7:AN8)>$D$15,\"\",-$AK$5/$D$15),0),\"\"))","v":-909090.90909090906},{"$f":"IF(torlesztes=\"Egyedi\",SUMIFS(Y$7:Y$126,T$7:T$126,\">\"&AJ7,T$7:T$126,\"<=\"&AJ8)+AE8,IFERROR(-AN8*tenylegeskamat/365*(AJ8-AJ7),\"\"))","v":-126239.10336239102},null,{"$f":"IFERROR(MAX((ABS(AM8)-ABS(AP8)),0),\"\")","v":921545.45454545447},{"$f":"IFERROR(AR8/POWER(1+($C$11+1%)/$D$19,AI8-1)/(1+($C$11+1%)/365*($AJ$7-$C$25)),\"\")","v":888258.68214234919},31]
[null,"Hitel devizaneme","HUF","Makrohoz kellenek (ne töröld ki!):",null,null,null,null,null,false,null,null,null,{"$f":"IF(ISBLANK(L8),\"\",L8)","v":""},{"$f":"IF(ISBLANK(L8),0,M8+O8)","v":0},0,0,"",null,null,null,"","","","","","2021-06-15",0,98181818.181818187,-1004682.4408468244,-121046.07721046077,30,null,3,{"$f":"IF(COUNT(AJ9)=1,AI8+1,\"\")","v":3},"2021-07-15",98181818.181818187,{"$f":"IF(torlesztes=\"Egyedi\",-SUMIFS(U$7:U$126,T$7:T$126,\">\"&AJ8,T$7:T$126,\"<=\"&AJ9),IFERROR(IF(torlesztes=\"Egyenlő tőke\",IF(COUNT($AK$7:AK9)>$D$15,\"\",-$AK$5/$D$15),0),\"\"))","v":-909090.90909090906},-1004682.4408468244,98181818.181818187,{"$f":"IF(torlesztes=\"Egyedi\",-SUMIFS(U$7:U$126,T$7:T$126,\">\"&AJ8,T$7:T$126,\"<=\"&AJ9),IFERROR(IF(torlesztes=\"Egyenlő tőke\",IF(COUNT($AN$7:AN9)>$D$15,\"\",-$AK$5/$D$15),0),\"\"))","v":-909090.90909090906},-121046.07721046077,null,883636.36363636365,849277.21824354329,30]
[null,"HUF/EUR árfolyam",360,{"$f":"+C17/D19","v":1.0375000000000001E-2},null,"Maximális hitelösszeghez tartozó támogatástartalom (EUR)",{"$f":"IF(2300000-C40-C41-C42-C45-C46-C47-C48-C49-C50<=0,\"Nem jogosult\",2300000-C40-C41-C42-C45-C46-C47-C48-C49-C50)","v":2300000},{"$f":"IF(mezogazdkizarok=0,\"Nem releváns\",IF(MIN(290000-C40-C45-C49,2300000-C40-C41-C42-C45-C46-C47-C48-C49-C50,345000-C40-C41-C45-C46-C49-C50)<=0,\"Nem jogosult\",MIN(290000-C40-C45-C49,2300000-C40-C41-C42-C45-C46-C47-C48-C49-C50,345000-C40-C41-C45-C46-C49-C50)))","v":"Nem releváns"},{"$f":"IF(halaszatikizarok=0,\"Nem releváns\",IF(MIN(345000-C41-C46-C50,2300000-C40-C41-C42-C45-C46-C47-C48-C49-C50,345000-C40-C41-C45-C46-C49-C50)<=0,\"Nem jogosult\",MIN(345000-C41-C46-C50,2300000-C40-C41-C42-C45-C46-C47-C48-C49-C50,345000-C40-C41-C45-C46-C49-C50)))","v":"Nem releváns"},false,null,null,null,"",0,0,0,"",null,null,null,"","","","","","2021-07-15",0,97272727.272727281,-1028559.1531755917,-123922.7895392279,31,null,4,{"$f":"IF(COUNT(AJ10)=1,AI9+1,\"\")","v":4},"2021-08-15",97272727.272727281,{"$f":"IF(torlesztes=\"Egyedi\",-SUMIFS(U$7:U$126,T$7:T$126,\">\"&AJ9,T$7:T$126,\"<=\"&AJ10),IFERROR(IF(torlesztes=\"Egyenlő tőke\",IF(COUNT($AK$7:AK10)>$D$15,\"\",-$AK$5/$D$15),0),\"\"))","v":-909090.90909090906},-1028559.1531755917,97272727.272727281,{"$f":"IF(torlesztes=\"Egyedi\",-SUMIFS(U$7:U$126,T$7:T$126,\">\"&AJ9,T$7:T$126,\"<=\"&AJ10),IFERROR(IF(torlesztes=\"Egyenlő tőke\",IF(COUNT($AN$7:AN10)>$D$15,\"\",-$AK$5/$D$15),0),\"\"))","v":-909090.90909090906},-123922.7895392279,null,904636.36363636376,866968.12494751462,31]
[null,"Referencia alapkamat - Kérjük adja meg a hatályos, devizanem szerinti értéket!",2.4500000000000001E-2,null,null,null,null,null,null,false,null,null,null,"",0,0,0,"",null,null,null,"","","","","","2021-08-15",0,96363636.363636374,-1018946.4508094647,-122764.63262764635,31,null,5,5,"2021-09-15",96363636.363636374,{"$f":"IF(torlesztes=\"Egyedi\",-SUMIFS(U$7:U$126,T$7:T$126,\">\"&AJ10,T$7:T$126,\"<=\"&AJ11),IFERROR(IF(torlesztes=\"Egyenlő tőke\",IF(COUNT($AK$7:AK11)>$D$15,\"\",-$AK$5/$D$15),0),\"\"))","v":-909090.90909090906},-1018946.4508094647,96363636.363636374,{"$f":"IF(torlesztes=\"Egyedi\",-SUMIFS(U$7:U$126,T$7:T$126,\">\"&AJ10,T$7:T$126,\"<=\"&AJ11),IFERROR(IF(torlesztes=\"Egyenlő tőke\",IF(COUNT($AN$7:AN11)>$D$15,\"\",-$AK$5/$D$15),0),\"\"))","v":-909090.90909090906},-122764.63262764635,null,896181.81818181835,856403.45916179346,31]
[null,"Van hitelfelvevői múltja vagy mérleg alapú hitelminősítése a hitelfelvevőnek?","Van",1E-4,null,"Teljes(kumulált) támogatás intenzítása",null,null,null,false,null,null,null,"",0,0,0,"",null,null,null,"","","","","","2021-09-15",0,95454545.454545468,-976774.59526774602,-117683.68617683687,30,null,6,6,"2021-10-15",95454545.454545468,{"$f":"IF(torlesztes=\"Egyedi\",-SUMIFS(U$7:U$126,T$7:T$126,\">\"&AJ11,T$7:T$126,\"<=\"&AJ12),IFERROR(IF(torlesztes=\"Egyenlő tőke\",IF(COUNT($AK$7:AK12)>$D$15,\"\",-$AK$5/$D$15),0),\"\"))","v":-909090.90909090906},-976774.59526774602,95454545.454545468,{"$f":"IF(torlesztes=\"Egyedi\",-SUMIFS(U$7:U$126,T$7:T$126,\">\"&AJ11,T$7:T$126,\"<=\"&AJ12),IFERROR(IF(torlesztes=\"Egyenlő tőke\",IF(COUNT($AN$7:AN12)>$D$15,\"\",-$AK$5/$D$15),0),\"\"))","v":-909090.90909090906},-117683.68617683687,null,859090.90909090918,818605.39456659474,30]
[null,"Cégbesorolás",null,null,null,"Beruházás elszámolható költsége (EUR)",{"$f":"C23/IF(C9<>\"EUR\",arfolyam,1)","v":388888.88888888888},null,null,false,null,null,null,"",0,0,0,"",null,null,null,"","","","","","2021-10-15",0,94545454.545454562,-999721.04607721069,-120448.31880448319,31,null,7,7,"2021-11-15",94545454.545454562,{"$f":"IF(torlesztes=\"Egyedi\",-SUMIFS(U$7:U$126,T$7:T$126,\">\"&AJ12,T$7:T$126,\"<=\"&AJ13),IFERROR(IF(torlesztes=\"Egyenlő tőke\",IF(COUNT($AK$7:AK13)>$D$15,\"\",-$AK$5/$D$15),0),\"\"))","v":-909090.90909090906},-999721.04607721069,94545454.545454562,{"$f":"IF(torlesztes=\"Egyedi\",-SUMIFS(U$7:U$126,T$7:T$126,\">\"&AJ12,T$7:T$126,\"<=\"&AJ13),IFERROR(IF(torlesztes=\"Egyenlő tőke\",IF(COUNT($AN$7:AN13)>$D$15,\"\",-$AK$5/$D$15),0),\"\"))","v":-909090.90909090906},-120448.31880448319,null,879272.72727272753,835434.25099907664,31]
[null,"Adósminősítés","Rossz",null,null,"Hitelre jutó támogatás intenzítása (EUR)",{"$f":"I4/eurelszamolhato","v":0.43057987012987103},null,null,false,null,null,null,"",0,0,0,"",null,null,null,"","","","","","2021-11-15",0,93636363.636363655,-958169.36488169385,-115442.09215442094,30,null,8,8,"2021-12-15",93636363.636363655,{"$f":"IF(torlesztes=\"Egyedi\",-SUMIFS(U$7:U$126,T$7:T$126,\">\"&AJ13,T$7:T$126,\"<=\"&AJ14),IFERROR(IF(torlesztes=\"Egyenlő tőke\",IF(COUNT($AK$7:AK14)>$D$15,\"\",-$AK$5/$D$15),0),\"\"))","v":-909090.90909090906},-958169.36488169385,93636363.636363655,{"$f":"IF(torlesztes=\"Egyedi\",-SUMIFS(U$7:U$126,T$7:T$126,\">\"&AJ13,T$7:T$126,\"<=\"&AJ14),IFERROR(IF(torlesztes=\"Egyenlő tőke\",IF(COUNT($AN$7:AN14)>$D$15,\"\",-$AK$5/$D$15),0),\"\"))","v":-909090.90909090906},-115442.09215442094,null,842727.27272727294,798415.42277711711,30]
[null,"Fedezettség","Alacsony",{"$f":"COUNT(AI7:AI126)","v":110},null,"Adott beruházási költséghez kapcsolódó teljes támogatás összege (EUR)",{"$f":"I4+IF(C34=\"Egyéb támogatások: pl. Egyéb GBER, ABER\",SUM(C45:C50)+C60,IF(C34=\"GBER 14, 17-es jogcímek\",SUM(C45:C50)+C53+C55,SUM(C45:C50)))","v":167447.72727272761},null,null,false,null,null,null,"",0,0,0,"",null,null,null,"","","","","","2021-12-15",0,92727272.727272749,-980495.6413449567,-118132.00498132009,31,null,9,9,"2022-01-15",92727272.727272749,{"$f":"IF(torlesztes=\"Egyedi\",-SUMIFS(U$7:U$126,T$7:T$126,\">\"&AJ14,T$7:T$126,\"<=\"&AJ15),IFERROR(IF(torlesztes=\"Egyenlő tőke\",IF(COUNT($AK$7:AK15)>$D$15,\"\",-$AK$5/$D$15),0),\"\"))","v":-909090.90909090906},-980495.6413449567,92727272.727272749,{"$f":"IF(torlesztes=\"Egyedi\",-SUMIFS(U$7:U$126,T$7:T$126,\">\"&AJ14,T$7:T$126,\"<=\"&AJ15),IFERROR(IF(torlesztes=\"Egyenlő tőke\",IF(COUNT($AN$7:AN15)>$D$15,\"\",-$AK$5/$D$15),0),\"\"))","v":-909090.90909090906},-118132.00498132009,null,862363.63636363659,814677.08068146929,31]
[null,"Kockázati felár (bázispont)",{"$f":"IF(C12=\"Van\",OFFSET(Adatok!$E$4,MATCH(C14,Adatok!$E$5:$E$9,0),MATCH(C15,Adatok!$F$4:$H$4,0),),MAX(OFFSET(Adatok!$E$4,MATCH(C14,Adatok!$E$5:$E$9,0),MATCH(C15,Adatok!$F$4:$H$4,0),),400))","v":1000},null,null,"Teljes támogatás intenzítása",{"$f":"G15/eurelszamolhato","v":0.43057987012987103},null,null,false,null,null,null,"",0,0,0,"",null,null,null,"","","","","","2022-01-15",0,91818181.818181843,-970882.93897882954,-116973.84806973851,31,null,10,{"$f":"IF(COUNT(AJ16)=1,AI15+1,\"\")","v":10},"2022-02-15",91818181.818181843,{"$f":"IF(torlesztes=\"Egyedi\",-SUMIFS(U$7:U$126,T$7:T$126,\">\"&AJ15,T$7:T$126,\"<=\"&AJ16),IFERROR(IF(torlesztes=\"Egyenlő tőke\",IF(COUNT($AK$7:AK16)>$D$15,\"\",-$AK$5/$D$15),0),\"\"))","v":-909090.90909090906},-970882.93897882954,91818181.818181843,{"$f":"IF(torlesztes=\"Egyedi\",-SUMIFS(U$7:U$126,T$7:T$126,\">\"&AJ15,T$7:T$126,\"<=\"&AJ16),IFERROR(IF(torlesztes=\"Egyenlő tőke\",IF(COUNT($AN$7:AN16)>$D$15,\"\",-$AK$5/$D$15),0),\"\"))","v":-909090.90909090906},-116973.84806973851,null,853909.09090909106,804377.46526606986,31]
[null,"Egyéni referencia kamatláb",{"$f":"+(C11+C16/10000)","v":0.1245},null,null,null,null,null,null,false,null,null,null,"",0,0,0,"",null,null,null,"","","","","","2022-02-15",0,90909090.909090936,-868244.0846824412,-104607.72104607723,28,null,11,{"$f":"IF(COUNT(AJ17)=1,AI16+1,\"\")","v":11},"2022-03-15",90909090.909090936,{"$f":"IF(torlesztes=\"Egyedi\",-SUMIFS(U$7:U$126,T$7:T$126,\">\"&AJ16,T$7:T$126,\"<=\"&AJ17),IFERROR(IF(torlesztes=\"Egyenlő tőke\",IF(COUNT($AK$7:AK17)>$D$15,\"\",-$AK$5/$D$15),0),\"\"))","v":-909090.90909090906},-868244.0846824412,90909090.909090936,{"$f":"IF(torlesztes=\"Egyedi\",-SUMIFS(U$7:U$126,T$7:T$126,\">\"&AJ16,T$7:T$126,\"<=\"&AJ17),IFERROR(IF(torlesztes=\"Egyenlő tőke\",IF(COUNT($AN$7:AN17)>$D$15,\"\",-$AK$5/$D$15),0),\"\"))","v":-909090.90909090906},-104607.72104607723,null,763636.363636364,717278.89718687523,28]
[null,null,null,null,null,"Maximális támogatási mértékek",{"$f":"IF(G16>G20,\"Nem finanszírozható\",\"\")","v":""},{"$f":"IF(G16>H20,\"Nem finanszírozható\",\"\")","v":"Nem finanszírozható"},null,false,null,null,null,"",0,0,0,"",null,null,null,"","","","","","2022-03-15",0,90000000.00000003,-951657.53424657567,-114657.53424657538,31,null,12,12,"2022-04-15",90000000.00000003,{"$f":"IF(torlesztes=\"Egyedi\",-SUMIFS(U$7:U$126,T$7:T$126,\">\"&AJ17,T$7:T$126,\"<=\"&AJ18),IFERROR(IF(torlesztes=\"Egyenlő tőke\",IF(COUNT($AK$7:AK18)>$D$15,\"\",-$AK$5/$D$15),0),\"\"))","v":-909090.90909090906},-951657.53424657567,90000000.00000003,{"$f":"IF(torlesztes=\"Egyedi\",-SUMIFS(U$7:U$126,T$7:T$126,\">\"&AJ17,T$7:T$126,\"<=\"&AJ18),IFERROR(IF(torlesztes=\"Egyenlő tőke\",IF(COUNT($AN$7:AN18)>$D$15,\"\",-$AK$5/$D$15),0),\"\"))","v":-909090.90909090906},-114657.53424657538,null,837000.00000000023,783935.09213387221,31]
[null,"HITELKARAKTERISZTIKA",null,{"$f":"VLOOKUP($C$31,Adatok!P3:Q5,2,0)","v":12},null,null,"14-es cikk","17-es cikk",null,false,null,null,null,"",0,0,0,"",null,null,null,"","","","","","2022-04-15",0,89090909.090909123,-911656.28891656315,-109838.10709838109,30,null,13,13,"2022-05-15",89090909.090909123,{"$f":"IF(torlesztes=\"Egyedi\",-SUMIFS(U$7:U$126,T$7:T$126,\">\"&AJ18,T$7:T$126,\"<=\"&AJ19),IFERROR(IF(torlesztes=\"Egyenlő tőke\",IF(COUNT($AK$7:AK19)>$D$15,\"\",-$AK$5/$D$15),0),\"\"))","v":-909090.90909090906},-911656.28891656315,89090909.090909123,{"$f":"IF(torlesztes=\"Egyedi\",-SUMIFS(U$7:U$126,T$7:T$126,\">\"&AJ18,T$7:T$126,\"<=\"&AJ19),IFERROR(IF(torlesztes=\"Egyenlő tőke\",IF(COUNT($AN$7:AN19)>$D$15,\"\",-$AK$5/$D$15),0),\"\"))","v":-909090.90909090906},-109838.10709838109,null,801818.18181818211,748830.87495999795,30]
[null,"Hitel fajtája/célja","Beruházási hitel",null,null,"Maximális támogatásintenzitás (%)",{"$f":"IF(tizennegyeskizarok=0,\"Nem jogosult\",IF(ttmax14es=0,0,(G22+C53+C48)/(forintelszamolhato/arfolyam)))","v":0.55000000000000004},{"$f":"IF(tizenheteskizarok=0,\"Nem jogosult\",IF(ttmax17es=0,0,(H22+C55+C48)/(eurelszamolhato)))","v":0.2},null,false,null,null,null,"",0,0,0,"",null,null,null,"","","","","","2022-05-15",0,88181818.181818217,-932432.1295143218,-112341.22042341225,31,null,14,14,"2022-06-15",88181818.181818217,{"$f":"IF(torlesztes=\"Egyedi\",-SUMIFS(U$7:U$126,T$7:T$126,\">\"&AJ19,T$7:T$126,\"<=\"&AJ20),IFERROR(IF(torlesztes=\"Egyenlő tőke\",IF(COUNT($AK$7:AK20)>$D$15,\"\",-$AK$5/$D$15),0),\"\"))","v":-909090.90909090906},-932432.1295143218,88181818.181818217,{"$f":"IF(torlesztes=\"Egyedi\",-SUMIFS(U$7:U$126,T$7:T$126,\">\"&AJ19,T$7:T$126,\"<=\"&AJ20),IFERROR(IF(torlesztes=\"Egyenlő tőke\",IF(COUNT($AN$7:AN20)>$D$15,\"\",-$AK$5/$D$15),0),\"\"))","v":-909090.90909090906},-112341.22042341225,null,820090.90909090952,763700.42963375349,31]
{"$rows_left_out":107}
{"sheet":"Szamitasok","index":2,"n_rows":25,"n_cols":8,"rows_kept":25,"cut":false,"hidden":true,"merged":[[19,0,19,9],[17,0,17,9],[21,0,21,9],[0,0,0,9],[2,0,2,1],[6,0,6,9],[7,0,7,9]]}
["Kizárók és KO-k"]
[null,null,null,"Váll. Méret","Mezőgazdasági","Halászat/akvakultúra"]
["Szorzó értéke",null,null,{"$f":"Tamogatastartalom!C21","v":"Mikró/Kis"}]
[{"$f":"PRODUCT(C4:W4)","v":1},"általános",null,null,null,null,null,1]
[{"$f":"PRODUCT(E5:F5)","v":0},"mezőgazdasági",null,null,{"$f":"IF(Tamogatastartalom!C22=\"Mezőgazdasági\",1,0)","v":0},null,null,1]
[{"$f":"PRODUCT(E6:F6)","v":0},"halászati",null,null,null,{"$f":"IF(Tamogatastartalom!C22=\"Halászati\",1,0)","v":0},null,1]
["14-es cikk"]
["R szorzó értéke"]
["Elszámolható ktg-ek EUR-ban",{"$f":"Tamogatastartalom!C23/IF(Tamogatastartalom!C9<>\"EUR\",arfolyam,1)","v":388888.88888888888}]
["A Elszámolható költségek",{"$f":"IF((B9-C10)>0,C10,B9)","v":388888.88888888888},50000000]
["B Elszámolható költségek",{"$f":"IF(B10<C10,0,IF(B9-C11<0,B9-C10,C10))","v":0},100000000]
["C elszámolható költségek","nincs!"]
["KKV bónusz",{"$f":"IF(D3=\"Mikró/Kis\",0.2,IF(D3=\"Közepes\",0.1,0))*IF(B9<50*10^6,1,0)","v":0.2}]
["Kaphat?",{"$f":"IF(B15>0,1,0)","v":1}]
["Alap intenzitás",{"$f":"VLOOKUP(Tamogatastartalom!C36,Adatok!A21:B216,2,FALSE)+IF(Tamogatastartalom!C36=\"Közép_Magyarország\",VLOOKUP(Tamogatastartalom!C37,Adatok!A21:'Adatok'!B216,2,FALSE))","v":0.35}]
["R szorzó értéke a támogatási térkép alapján",{"$f":"(B15+B13)*B14","v":0.55000000000000004}]
["Max. TT (EUR)",{"$f":"VLOOKUP(B15,Adatok!D12:E16,2,FALSE)*10^6","v":26250000}]
["17-es cikk"]
["Vállalatméret-szorzó",{"$f":"IF(D3=\"Nagy\",0,IF(D3=\"Mikró/Kis\",0.2,0.1))","v":0.2}]
["HUF érték"]
{"$rows_left_out":6}
{"sheet":"Adatok","index":3,"n_rows":216,"n_cols":21,"rows_kept":216,"cut":false,"hidden":true,"merged":[[9,0,9,11],[0,12,0,22],[4,3,8,3],[1,3,1,7],[2,5,2,7],[0,0,0,11],[1,9,1,11]]}
["Felárak",null,null,null,null,null,null,null,null,null,null,null,"Segédszámítások"]
[null,null,null,"Piaci referencia",null,null,null,null,null,"Refin kamatok",null,null,"Törlesztés",null,null,"Törlesztésgyakoriság",null,null,"Select",null,"Select"]
[null,null,null,null,null,"Fedezettség",null,null,null,null,null,null,"Egyenlő összeg",1,null,"Havi",12,null,"Beruházási hitel",null,"Beruházási hitel"]
[null,null,null,null,null,"Magas","Általános","Alacsony",null,"Min 1",{"$f":"refkam-3.5%","v":-1.0500000000000002E-2},null,"Egyenlő tőke",2,null,"Negyedéves",4,null,"Forgóeszközhitel",null,"Lízing"]
[null,null,null,"Hitelminősítés","Kiváló",60,75,100,null,"Min2",1E-3,null,"Egyedi",0,null,"Féléves",2,null,"Lízing"]
[null,null,null,null,"Jó",75,100,220,null,"Tényleges min",{"$f":"MAX(K4:K5)","v":1E-3}]
[null,null,null,null,"Kielégítő",100,220,400,null,"Max",{"$f":"refkammin+4%","v":4.1000000000000002E-2},null,"Annuitás"]
[null,null,null,null,"Gyenge",220,400,650]
[null,null,null,null,"Rossz",400,650,1000]
["Regionális támogatási intenzitások"]
[null,"Nagyvállalat",null,"Intenzitás","MAX Támogatástartalom (mio EUR)"]
["Select",0,null,0.5,37.5]
["Dél-Alföld",0.5,null,0.35,26.25]
["Dél-Dunántúl",0.5,null,0.25,18.75]
["Észak-Alföld",0.5,null,0.2,15]
["Észak-Magyarország",0.5,null,0,0]
["Közép-Dunántúl",0.35,null,null,null,null,null,null,null," "]
["Közép_Magyarország",0]
["Nyugat-Dunántúl",0.25]
[null,"14-es cikk"]
{"$rows_left_out":196}