{"text_format":"1","workbook":"xlsx","n_sheets":4,"sheets":["Elolap","Tamogatastartalom","Szamitasok","Adatok"],"not_rendered":{"charts":0,"images":0,"macros":1,"external_links":0,"defined_names":59,"comments":1,"pivot_tables":0},"unopened":[],"bounds":{"document_bytes":16777216,"sheet_cells":100000,"rows_first":2000,"rows_last":500,"rows_between":2000,"halvings":0,"cell_chars":16384,"cell_head_chars":4096},"cells_cut":0,"cells_raw":0,"read":"whole","date_system":"1900"}

{"sheet":"Elolap","index":0,"n_rows":0,"n_cols":0,"rows_kept":0,"cut":false,"hidden":false,"merged":[]}

{"sheet":"Tamogatastartalom","index":1,"n_rows":134,"n_cols":58,"rows_kept":134,"cut":false,"hidden":false,"merged":[[10,6,12,6],[0,23,1,24],[0,14,1,15],[3,1,3,2],[5,1,5,2],[7,6,9,6],[2,57,3,57],[3,5,4,5],[2,23,3,23],[2,24,3,24],[2,52,2,53],[2,48,2,50],[2,25,2,29],[2,31,2,36],[2,42,2,44],[2,14,3,14],[2,15,3,15],[2,45,2,47],[2,54,2,55]]}
[null,null,null,null,null,null,null,null,null,null,null,null,null,null,{"$f":"IF(SUM(P7:P134)<C24,\"A folyósítások összege kevesebb, mint a hitelösszeg\",\"A folyósítások összege több, mint a hitelösszeg\")","v":"A folyósítások összege több, mint a hitelösszeg"},null,null,null,null,null,null,null,null,{"$f":"IF(SUM(Y7:Y134)<C24,\"A törlesztések összege kevesebb, mint a hitelösszeg\",\"A törlesztések összege több, mint a hitelösszeg\")","v":"A törlesztések összege több, mint a hitelösszeg"}]
[]
[null,"Ügyfél neve: ",null,null,null,null,null,null,"EUR","HUF",null,null,null,null,"Egyedi folyósítás dátuma","Folyósítás összege",null,null,null,null,null,null,null,"Egyedi törlesztés dátuma","Tőkeamortizáció egyedi törlesztés esetén","periódusközi kamatszámítás",null,null,null,null,null,"maradék kamatszámítás",null,null,null,null,null,null,null,null,null,null,"Piaci konstrukció",null,null,"Minimum kamat 2.3",null,null,"Támogatott konstruckió",null,null,null,"Támogatástartalom",null,"Támogatástartalom (min 2.3)",null,null,"Támogatástartalom + egyéb kedvezmények"]
[null,null,null,null,-0.04,null,"Hitelösszeg (EUR)",null,{"$f":"IF(C9=\"HUF\",C24/C10,C24)","v":{"$error":"#DIV/0!"}},{"$f":"IF(C9=\"HUF\",C24,C24*arfolyam)","v":0},null,null,null,null,null,null,null,null,"kamat","kamat (min 2.3)","támogatott",null,null,null,null,"dátumtól","tőke","kamat","kamat (min 2.3)","támogatott",null,"dátumtól","amort","tőke","maradék","maradék (min 2.3)","t maradék",null,null,null,"Periodus","Dátum","Tőke","Tőkeamt.","Kamatfiz.","Tőke","Tőkeamt.","Kamatfiz.","Tőke","Tőkeamt.","Kamatfiz.",null,"FV","PV","FV","PV"]
[null,"Pénzügyi intézmény neve refinanszírozás esetén: ",null,null,{"$f":"IF(C22=\"Halászati\",K10,IF(C22=\"Mezőgazdasági\",K9,K8))","v":2000000},null,"Ténylegesen felvett hitel támogatástartalma 2.1",null,{"$f":"IF(C9=\"HUF\",BC5/C10,BC5)","v":{"$error":"#DIV/0!"}},{"$f":"IF(C9=\"HUF\",BC5,BC5*C10)","v":0},{"$f":"IFERROR(IF(E5-I5<=0,\"Nem elegendő a 2.1 szabad keret\",\"Elegendő a 2.1 szabad keret\"),\"\")","v":""},{"$f":"IFERROR(IF(E6-I5<=0,\"Nem elegendő a 3.1 szabad keret\",\"Elegendő a 3.1 szabad keret\"),\"\")","v":""},null,null,null,null,null,null,{"$f":"SUM(S7:S134)","v":0},{"$f":"SUM(T7:T134)","v":0},{"$f":"SUM(U7:U134)","v":0},null,null,null,null,null,null,{"$f":"SUM(AB7:AB134)","v":0},{"$f":"SUM(AC7:AC134)","v":0},{"$f":"SUM(AD7:AD134)","v":0},null,null,null,null,{"$f":"SUM(AI7:AI134)","v":0},{"$f":"SUM(AJ7:AJ134)","v":0},{"$f":"SUM(AK7:AK134)","v":0},null,null,null,null,null,{"$f":"+AQ7","v":0},{"$f":"SUM(AR7:AR134)","v":0},{"$f":"SUM(AS7:AS134)","v":0},{"$f":"+AT7","v":0},{"$f":"SUM(AU7:AU134)","v":0},{"$f":"SUM(AV7:AV134)","v":0},{"$f":"+AW7","v":0},{"$f":"SUM(AX7:AX134)","v":0},{"$f":"SUM(AY7:AY134)","v":0},null,{"$f":"SUM(BA7:BA134)","v":0},{"$f":"SUM(BB7:BB134)","v":0},{"$f":"SUM(BC7:BC134)","v":0},{"$f":"SUM(BD7:BD134)","v":0},null,{"$f":"BB5","v":0}]
[null,null,null,null,{"$f":"IF(C22=\"Halászati\",K13,IF(C22=\"Mezőgazdasági\",K12,K11))","v":2300000},null,"Ténylegesen felvett hitel támogatástartalma 2.3",null,{"$f":"IF(C9=\"HUF\",BB5/C10,BB5)","v":{"$error":"#DIV/0!"}},{"$f":"IF(C9=\"HUF\",BB5,BB5*C10)","v":0},null,null,"Törlesztésiidőszak vége?",null,null,null,null,null,null,null,null,null,null,null,null,null,null,null,null,null,null,null,null,null,null,null,null,null,null,null,0,{"$f":"MAX(C27,MIN(O7:O134))","v":"00:00:00"}]
[null,null,null,null,null,null,null,null,null,null,null,null,{"$f":"AO7>$E$15","v":true},null,null,null,{"$f":"C27","v":"00:00:00"},{"$f":"IF(ISBLANK(O7),C24,0)","v":0},{"$f":"IF(AND(ISBLANK(O6),AN7<>1),0,IFERROR(-R7*piacikamat/365*(IF(ISBLANK(O7),$C$28,O7)-Q7),\"\"))","v":0},{"$f":"IF(AND(ISBLANK(O6),AN7<>1),0,IFERROR(-R7*minkamat23/365*(IF(ISBLANK(O7),$C$28,O7)-Q7),\"\"))","v":0},{"$f":"IF(AND(ISBLANK(O6),AN7<>1),0,IFERROR(-R7*tenylegeskamat/365*(IF(ISBLANK(O7),$C$28,O7)-Q7),\"\"))","v":0},{"$f":"IFERROR(IF(ISBLANK(O7),$C$28,O7)-Q7,\"\")","v":0},null,null,null,{"$f":"IF(ISNA(MAX(X6,INDEX(AP$6:AP$134,MATCH(X7-1,AP$6:AP$134,1)))),\"\",MAX(X6,INDEX(AP$6:AP$134,MATCH(X7-1,AP$6:AP$134,1))))","v":""},{"$f":"IF(ISNA(MIN(IF(OR(ISBLANK(AA6),AA6=\"\"),INDEX(AQ$7:AQ$134,MATCH(X7,AP$7:AP$134,1)),AA6-Y6),INDEX(AQ$7:AQ$134,MATCH(X7,AP$7:AP$134,1)))),\"\",MIN(IF(OR(ISBLANK(AA6),AA6=\"\"),INDEX(AQ$7:AQ$134,MATCH(X7,AP$7:AP$134,1)),AA6-Y6),INDEX(AQ$7:AQ$134,MATCH(X7,AP$7:AP$134,1))))","v":0},{"$f":"IFERROR(-AA7*piacikamat/365*(X7-Z7),\"\")","v":""},{"$f":"IFERROR(-AA7*minkamat23/365*(X7-Z7),\"\")","v":""},{"$f":"IFERROR(-AA7*tenylegeskamat/365*(X7-Z7),\"\")","v":""},{"$f":"IFERROR(X7-Z7,\"\")","v":""},{"$f":"MAX(AP6,IF(ISNA(INDEX(X$7:X$134,MATCH(AP7,X$7:X$134,1))),0,INDEX(X$7:X$134,MATCH(AP7,X$7:X$134,1))))","v":"00:00:00"},{"$f":"IF(ISNA(INDEX(Y$7:Y$134,MATCH(AP7,X$7:X$134,1))),0,INDEX(Y$7:Y$134,MATCH(AP7,X$7:X$134,1)))","v":0},{"$f":"IF(ISNA(INDEX(AA$7:AA$134,MATCH(AP7,X$7:X$134,1))),AQ7,INDEX(AA$7:AA$134,MATCH(AP7,X$7:X$134,1)))","v":0},{"$f":"IFERROR(-(AH7-AG7)*piacikamat/365*(AP7-AF7),0)","v":0},{"$f":"IFERROR(-(AH7-AG7)*minkamat23/365*(AP7-AF7),0)","v":0},{"$f":"IFERROR(-(AH7-AG7)*tenylegeskamat/365*(AP7-AF7),0)","v":0},{"$f":"IFERROR(AP7-AF7,\"\")","v":0},null,1,{"$f":"+IF(C29-C28<>0,1,\"\")","v":""},{"$f":"C28","v":"00:00:00"},{"$f":"IF(+C24<>0,C24,IF(AO7>0,C24*M7,\"\"))","v":0},{"$f":"IF(torlesztes=\"Egyedi\",-SUMIFS(Y$7:Y$134,X$7:X$134,\">\"&AP6,X$7:X$134,\"<=\"&AP7),IFERROR(IF(torlesztes=\"Egyenlő tőke\",IF(COUNT($AQ$7:AQ7)>$E$15,\"\",-$AQ$5/$E$15),0),\"\"))","v":""},{"$f":"SUM(S7:S134)","v":0},{"$f":"IF(+C24<>0,C24,IF(AO7>0,C24*M7,\"\"))","v":0},{"$f":"IF(torlesztes=\"Egyedi\",-SUMIFS(Y$7:Y$134,X$7:X$134,\">\"&AP6,X$7:X$134,\"<=\"&AP7),IFERROR(IF(torlesztes=\"Egyenlő tőke\",IF(COUNT($AT$7:AT7)>$E$15,\"\",-$AT$5/$E$15),0),\"\"))","v":""},{"$f":"SUM(T7:T134)","v":0},{"$f":"+AQ7","v":0},{"$f":"IF(torlesztes=\"Egyedi\",-SUMIFS(Y$7:Y$134,X$7:X$134,\">\"&AP6,X$7:X$134,\"<=\"&AP7),IFERROR(IF(torlesztes=\"Egyenlő tőke\",IF(COUNT($AW$7:AW7)>$E$15,\"\",-$AQ$5/$E$15),0),\"\"))","v":""},{"$f":"SUM(U7:U134)","v":0},null,{"$f":"IFERROR(MAX((ABS(AS7)-ABS(AY7)),0),\"\")","v":0},{"$f":"IFERROR(BA7/(1+($C$11+1%)/365*(AP7-C26)),\"\")","v":0},{"$f":"IFERROR(MAX((ABS(AV7)-ABS(AY7)),0),\"\")","v":0},{"$f":"IFERROR(BC7/(1+($C$11+1%)/365*(AP7-C26)),\"\")","v":0},{"$f":"IFERROR(AP7-AP6,\"\")","v":0}]
[null,"PIACI KAMAT MEGHATÁROZÁSA",null,null,null,null,"Válságkezelési közlemény 2.1 alapján megítélt támogatásokon felül igénybe vehető szabad keret (EUR)","Általános szabály",null,null,{"$f":"IF(2000000-C42-C43-C44-C47-C48-C49-C53-C54-C55<=0,\"Nincs szabad keret, nem finanszírozható\",2000000-C42-C43-C44-C47-C48-C49-C53-C54-C55)","v":2000000},null,{"$f":"AO8>$E$15","v":true},null,null,null,{"$f":"IF(ISBLANK(O7),\"\",O7)","v":""},{"$f":"IF(ISBLANK(O7),0,P7+R7)","v":0},0,0,0,"",null,null,null,"",0,"","","","","00:00:00",0,0,0,0,0,"",null,2,{"$f":"IF(COUNT(AP8)=1,AO7+1,\"\")","v":""},{"$f":"IF(OR(AP7=$C$29,AP7=\"\"),\"\",IFERROR(IF(EDATE($C$28,(AN8-1)*12/$E$19)<=$C$29,EDATE($C$28,(AN8-1)*12/$E$19),$C$29),\"\"))","v":""},{"$f":"+IF(COUNT(AQ7)<>0,SUM(AQ7:AR7)*(1-M8),\"\")","v":0},{"$f":"IF(torlesztes=\"Egyedi\",-SUMIFS(Y$7:Y$134,X$7:X$134,\">\"&AP7,X$7:X$134,\"<=\"&AP8),IFERROR(IF(torlesztes=\"Egyenlő tőke\",IF(COUNT($AQ$7:AQ8)>$E$15,\"\",-$AQ$5/$E$15),0),\"\"))","v":""},{"$f":"IF(torlesztes=\"Egyedi\",SUMIFS(AB$7:AB$134,X$7:X$134,\">\"&AP7,X$7:X$134,\"<=\"&AP8)+AI8,IFERROR(-AQ8*piacikamat/365*(AP8-AP7),\"\"))","v":""},{"$f":"+IF(COUNT(AT7)<>0,SUM(AT7:AU7)*(1-M8),\"\")","v":0},{"$f":"IF(torlesztes=\"Egyedi\",-SUMIFS(Y$7:Y$134,X$7:X$134,\">\"&AP7,X$7:X$134,\"<=\"&AP8),IFERROR(IF(torlesztes=\"Egyenlő tőke\",IF(COUNT($AT$7:AT8)>$E$15,\"\",-$AT$5/$E$15),0),\"\"))","v":""},{"$f":"IF(torlesztes=\"Egyedi\",SUMIFS(AC$7:AC$134,X$7:X$134,\">\"&AP7,X$7:X$134,\"<=\"&AP8)+AJ8,IFERROR(-AT8*minkamat23/365*(AP8-AP7),\"\"))","v":""},{"$f":"+IF(COUNT(AW7)<>0,SUM(AW7:AX7)*(1-M8),\"\")","v":0},{"$f":"IF(torlesztes=\"Egyedi\",-SUMIFS(Y$7:Y$134,X$7:X$134,\">\"&AP7,X$7:X$134,\"<=\"&AP8),IFERROR(IF(torlesztes=\"Egyenlő tőke\",IF(COUNT($AW$7:AW8)>$E$15,\"\",-$AQ$5/$E$15),0),\"\"))","v":""},{"$f":"IF(torlesztes=\"Egyedi\",SUMIFS(AD$7:AD$134,X$7:X$134,\">\"&AP7,X$7:X$134,\"<=\"&AP8)+AK8,IFERROR(-AW8*tenylegeskamat/365*(AP8-AP7),\"\"))","v":""},null,{"$f":"IFERROR(MAX((ABS(AS8)-ABS(AY8)),0),\"\")","v":""},{"$f":"IFERROR(BA8/POWER(1+($C$11+1%)/$E$19,AO8-1)/(1+($C$11+1%)/365*($AP$7-$C$26)),\"\")","v":""},{"$f":"IFERROR(MAX((ABS(AV8)-ABS(AY8)),0),\"\")","v":""},{"$f":"IFERROR(BC8/POWER(1+($C$11+1%)/$E$19,AO8-1)/(1+($C$11+1%)/365*($AP$7-$C$26)),\"\")","v":""},""]
[null,"Hitel devizaneme","HUF",null,"Makrohoz kellenek (ne töröld ki!):",null,null,"Mezőgazdasági szabály",null,null,{"$f":"IF(mezogazdkizarok=0,\"Nem releváns\",IF(MIN(250000-C42-C47-C54,2000000-C42-C43-C44-C47-C48-C49-C53-C54-C55,300000-C42-C43-C47-C48-C54-C55)<=0,\"Nincs szabad keret, nem finanszírozható\",MIN(250000-C42-C47-C54,2000000-C42-C43-C44-C47-C48-C49-C53-C54-C55,300000-C42-C43-C47-C48-C54-C55)))","v":"Nem releváns"},null,true,null,null,null,{"$f":"IF(ISBLANK(O8),\"\",O8)","v":""},{"$f":"IF(ISBLANK(O8),0,P8+R8)","v":0},0,0,0,"",null,null,null,"",0,"","","","","00:00:00",0,0,0,0,0,"",null,3,{"$f":"IF(COUNT(AP9)=1,AO8+1,\"\")","v":""},"",0,{"$f":"IF(torlesztes=\"Egyedi\",-SUMIFS(Y$7:Y$134,X$7:X$134,\">\"&AP8,X$7:X$134,\"<=\"&AP9),IFERROR(IF(torlesztes=\"Egyenlő tőke\",IF(COUNT($AQ$7:AQ9)>$E$15,\"\",-$AQ$5/$E$15),0),\"\"))","v":""},"",{"$f":"+IF(COUNT(AT8)<>0,SUM(AT8:AU8)*(1-M9),\"\")","v":0},{"$f":"IF(torlesztes=\"Egyedi\",-SUMIFS(Y$7:Y$134,X$7:X$134,\">\"&AP8,X$7:X$134,\"<=\"&AP9),IFERROR(IF(torlesztes=\"Egyenlő tőke\",IF(COUNT($AT$7:AT9)>$E$15,\"\",-$AT$5/$E$15),0),\"\"))","v":""},"",0,{"$f":"IF(torlesztes=\"Egyedi\",-SUMIFS(Y$7:Y$134,X$7:X$134,\">\"&AP8,X$7:X$134,\"<=\"&AP9),IFERROR(IF(torlesztes=\"Egyenlő tőke\",IF(COUNT($AW$7:AW9)>$E$15,\"\",-$AQ$5/$E$15),0),\"\"))","v":""},"",null,"","","","",""]
[null,"HUF/EUR árfolyam",null,null,{"$f":"+C17/E19","v":5.0000000000000001E-4},null,null,"Halászati szabály",null,null,{"$f":"IF(halaszatikizarok=0,\"Nem releváns\",IF(MIN(300000-C43-C48-C55,2000000-C42-C43-C44-C47-C48-C49-C53-C54-C55,300000-C42-C43-C47-C48-C54-C55)<=0,\"Nincs szabad keret, nem finanszírozható\",MIN(300000-C43-C48-C55,2000000-C42-C43-C44-C47-C48-C49-C53-C54-C55,300000-C42-C43-C47-C48-C54-C55)))","v":"Nem releváns"},null,true,null,null,null,"",0,0,0,0,"",null,null,null,"",0,"","","","","00:00:00",0,0,0,0,0,"",null,4,{"$f":"IF(COUNT(AP10)=1,AO9+1,\"\")","v":""},"",0,{"$f":"IF(torlesztes=\"Egyedi\",-SUMIFS(Y$7:Y$134,X$7:X$134,\">\"&AP9,X$7:X$134,\"<=\"&AP10),IFERROR(IF(torlesztes=\"Egyenlő tőke\",IF(COUNT($AQ$7:AQ10)>$E$15,\"\",-$AQ$5/$E$15),0),\"\"))","v":""},"",0,{"$f":"IF(torlesztes=\"Egyedi\",-SUMIFS(Y$7:Y$134,X$7:X$134,\">\"&AP9,X$7:X$134,\"<=\"&AP10),IFERROR(IF(torlesztes=\"Egyenlő tőke\",IF(COUNT($AT$7:AT10)>$E$15,\"\",-$AT$5/$E$15),0),\"\"))","v":""},"",0,{"$f":"IF(torlesztes=\"Egyedi\",-SUMIFS(Y$7:Y$134,X$7:X$134,\">\"&AP9,X$7:X$134,\"<=\"&AP10),IFERROR(IF(torlesztes=\"Egyenlő tőke\",IF(COUNT($AW$7:AW10)>$E$15,\"\",-$AQ$5/$E$15),0),\"\"))","v":""},"",null,"","","","",""]
[null,"Reference and discount rates (europa.eu) - Kérjük adja meg a hatályos, devizanem szerinti értéket!",null,null,null,null,"COVID Közlemény 3.1 alapján megítélt támogatásokon felül igénybe vehető szabad keret (EUR)","Általános szabály",null,null,{"$f":"IF(2300000-C47-C48-C49-C53-C54-C55-C58-C59-C60<=0,\"Nincs szabad keret, nem finanszírozható\",2300000-C47-C48-C49-C53-C54-C55-C58-C59-C60)","v":2300000},null,true,null,null,null,"",0,0,0,0,"",null,null,null,"",0,"","","","","00:00:00",0,0,0,0,0,"",null,5,"","",0,{"$f":"IF(torlesztes=\"Egyedi\",-SUMIFS(Y$7:Y$134,X$7:X$134,\">\"&AP10,X$7:X$134,\"<=\"&AP11),IFERROR(IF(torlesztes=\"Egyenlő tőke\",IF(COUNT($AQ$7:AQ11)>$E$15,\"\",-$AQ$5/$E$15),0),\"\"))","v":""},"",0,{"$f":"IF(torlesztes=\"Egyedi\",-SUMIFS(Y$7:Y$134,X$7:X$134,\">\"&AP10,X$7:X$134,\"<=\"&AP11),IFERROR(IF(torlesztes=\"Egyenlő tőke\",IF(COUNT($AT$7:AT11)>$E$15,\"\",-$AT$5/$E$15),0),\"\"))","v":""},"",0,{"$f":"IF(torlesztes=\"Egyedi\",-SUMIFS(Y$7:Y$134,X$7:X$134,\">\"&AP10,X$7:X$134,\"<=\"&AP11),IFERROR(IF(torlesztes=\"Egyenlő tőke\",IF(COUNT($AW$7:AW11)>$E$15,\"\",-$AQ$5/$E$15),0),\"\"))","v":""},"",null,"","","","",""]
[null,"Van hitelfelvevői múltja vagy mérleg alapú hitelminősítése a hitelfelvevőnek?","Van",null,1E-4,null,null,"Mezőgazdasági szabály",null,null,{"$f":"IF(mezogazdkizarok=0,\"Nem releváns\",IF(MIN(290000-C47-C54-C58,2300000-C47-C48-C49-C53-C54-C55-C58-C59-C60,345000-C47-C48-C54-C55-C58-C59)<=0,\"Nincs szabad keret, nem finanszírozható\",MIN(290000-C47-C54-C58,2300000-C47-C48-C49-C53-C54-C55-C58-C59-C60,345000-C47-C48-C54-C55-C58-C59)))","v":"Nem releváns"},null,true,null,null,null,"",0,0,0,0,"",null,null,null,"",0,"","","","","00:00:00",0,0,0,0,0,"",null,6,"","",0,{"$f":"IF(torlesztes=\"Egyedi\",-SUMIFS(Y$7:Y$134,X$7:X$134,\">\"&AP11,X$7:X$134,\"<=\"&AP12),IFERROR(IF(torlesztes=\"Egyenlő tőke\",IF(COUNT($AQ$7:AQ12)>$E$15,\"\",-$AQ$5/$E$15),0),\"\"))","v":""},"",0,{"$f":"IF(torlesztes=\"Egyedi\",-SUMIFS(Y$7:Y$134,X$7:X$134,\">\"&AP11,X$7:X$134,\"<=\"&AP12),IFERROR(IF(torlesztes=\"Egyenlő tőke\",IF(COUNT($AT$7:AT12)>$E$15,\"\",-$AT$5/$E$15),0),\"\"))","v":""},"",0,{"$f":"IF(torlesztes=\"Egyedi\",-SUMIFS(Y$7:Y$134,X$7:X$134,\">\"&AP11,X$7:X$134,\"<=\"&AP12),IFERROR(IF(torlesztes=\"Egyenlő tőke\",IF(COUNT($AW$7:AW12)>$E$15,\"\",-$AQ$5/$E$15),0),\"\"))","v":""},"",null,"","","","",""]
[null,"Cégbesorolás",null,null,null,null,null,"Halászati szabály",null,null,{"$f":"IF(halaszatikizarok=0,\"Nem releváns\",IF(MIN(345000-C48-C55-C59,2300000-C47-C48-C49-C53-C54-C55-C58-C59-C60,345000-C47-C48-C54-C55-C58-C59)<=0,\"Nincs szabad keret, nem finanszírozható\",MIN(345000-C48-C55-C59,2300000-C47-C48-C49-C53-C54-C55-C58-C59-C60,345000-C47-C48-C54-C55-C58-C59)))","v":"Nem releváns"},null,true,null,null,null,"",0,0,0,0,"",null,null,null,"",0,"","","","","00:00:00",0,0,0,0,0,"",null,7,"","",0,{"$f":"IF(torlesztes=\"Egyedi\",-SUMIFS(Y$7:Y$134,X$7:X$134,\">\"&AP12,X$7:X$134,\"<=\"&AP13),IFERROR(IF(torlesztes=\"Egyenlő tőke\",IF(COUNT($AQ$7:AQ13)>$E$15,\"\",-$AQ$5/$E$15),0),\"\"))","v":""},"",0,{"$f":"IF(torlesztes=\"Egyedi\",-SUMIFS(Y$7:Y$134,X$7:X$134,\">\"&AP12,X$7:X$134,\"<=\"&AP13),IFERROR(IF(torlesztes=\"Egyenlő tőke\",IF(COUNT($AT$7:AT13)>$E$15,\"\",-$AT$5/$E$15),0),\"\"))","v":""},"",0,{"$f":"IF(torlesztes=\"Egyedi\",-SUMIFS(Y$7:Y$134,X$7:X$134,\">\"&AP12,X$7:X$134,\"<=\"&AP13),IFERROR(IF(torlesztes=\"Egyenlő tőke\",IF(COUNT($AW$7:AW13)>$E$15,\"\",-$AQ$5/$E$15),0),\"\"))","v":""},"",null,"","","","",""]
[null,"Adósminősítés","Kiváló",null,null,null,null,null,null,null,null,null,true,null,null,null,"",0,0,0,0,"",null,null,null,"",0,"","","","","00:00:00",0,0,0,0,0,"",null,8,"","",0,{"$f":"IF(torlesztes=\"Egyedi\",-SUMIFS(Y$7:Y$134,X$7:X$134,\">\"&AP13,X$7:X$134,\"<=\"&AP14),IFERROR(IF(torlesztes=\"Egyenlő tőke\",IF(COUNT($AQ$7:AQ14)>$E$15,\"\",-$AQ$5/$E$15),0),\"\"))","v":""},"",0,{"$f":"IF(torlesztes=\"Egyedi\",-SUMIFS(Y$7:Y$134,X$7:X$134,\">\"&AP13,X$7:X$134,\"<=\"&AP14),IFERROR(IF(torlesztes=\"Egyenlő tőke\",IF(COUNT($AT$7:AT14)>$E$15,\"\",-$AT$5/$E$15),0),\"\"))","v":""},"",0,{"$f":"IF(torlesztes=\"Egyedi\",-SUMIFS(Y$7:Y$134,X$7:X$134,\">\"&AP13,X$7:X$134,\"<=\"&AP14),IFERROR(IF(torlesztes=\"Egyenlő tőke\",IF(COUNT($AW$7:AW14)>$E$15,\"\",-$AQ$5/$E$15),0),\"\"))","v":""},"",null,"","","","",""]
[null,"Fedezettség","Magas",null,{"$f":"COUNT(AO7:AO134)","v":0},null,"Teljes(kumulált) támogatás intenzítása",null,null,null,null,null,true,null,null,null,"",0,0,0,0,"",null,null,null,"",0,"","","","","00:00:00",0,0,0,0,0,"",null,9,"","",0,{"$f":"IF(torlesztes=\"Egyedi\",-SUMIFS(Y$7:Y$134,X$7:X$134,\">\"&AP14,X$7:X$134,\"<=\"&AP15),IFERROR(IF(torlesztes=\"Egyenlő tőke\",IF(COUNT($AQ$7:AQ15)>$E$15,\"\",-$AQ$5/$E$15),0),\"\"))","v":""},"",0,{"$f":"IF(torlesztes=\"Egyedi\",-SUMIFS(Y$7:Y$134,X$7:X$134,\">\"&AP14,X$7:X$134,\"<=\"&AP15),IFERROR(IF(torlesztes=\"Egyenlő tőke\",IF(COUNT($AT$7:AT15)>$E$15,\"\",-$AT$5/$E$15),0),\"\"))","v":""},"",0,{"$f":"IF(torlesztes=\"Egyedi\",-SUMIFS(Y$7:Y$134,X$7:X$134,\">\"&AP14,X$7:X$134,\"<=\"&AP15),IFERROR(IF(torlesztes=\"Egyenlő tőke\",IF(COUNT($AW$7:AW15)>$E$15,\"\",-$AQ$5/$E$15),0),\"\"))","v":""},"",null,"","","","",""]
{"$rows_left_out":120}
{"sheet":"Szamitasok","index":2,"n_rows":25,"n_cols":9,"rows_kept":25,"cut":false,"hidden":true,"merged":[[19,0,19,9],[17,0,17,9],[21,0,21,9],[0,0,0,9],[2,0,2,1],[6,0,6,9],[7,0,7,9]]}
["Kizárók és KO-k"]
[null,null,null,"Váll. Méret","Mezőgazdasági","Halászat/akvakultúra",null,null,"Régió"]
["Szorzó értéke",null,null,{"$f":"Tamogatastartalom!C21","v":"Közepes"},null,null,null,null,{"$f":"Tamogatastartalom!C39","v":"Közép-Dunántúl"}]
[{"$f":"PRODUCT(C4:W4)","v":1},"általános",null,null,null,null,null,1]
[{"$f":"PRODUCT(E5:F5)","v":0},"mezőgazdasági",null,null,{"$f":"IF(Tamogatastartalom!C22=\"Mezőgazdasági\",1,0)","v":0},null,null,{"$f":"PRODUCT(I5)","v":1},{"$f":"IF(I3=\"Budapest\",0,1)","v":1}]
[{"$f":"PRODUCT(E6:F6)","v":0},"halászati",null,null,null,{"$f":"IF(Tamogatastartalom!C22=\"Halászati\",1,0)","v":0},null,1]
["14-es cikk"]
["R szorzó értéke"]
["Elszámolható ktg-ek EUR-ban",{"$f":"Tamogatastartalom!C23/IF(Tamogatastartalom!C9<>\"EUR\",arfolyam,1)","v":{"$error":"#DIV/0!"}}]
["A Elszámolható költségek",{"$f":"IF((B9-C10)>0,C10,B9)","v":{"$error":"#DIV/0!"}},50000000]
["B Elszámolható költségek",{"$f":"IF(B10<C10,0,IF(B9-C11<0,B9-C10,C10))","v":{"$error":"#DIV/0!"}},100000000]
["C elszámolható költségek","nincs!"]
["KKV bónusz",{"$f":"IF(D3=\"Mikró/Kis\",0.2,IF(D3=\"Közepes\",0.1,0))*IF(B9<50*10^6,1,0)","v":{"$error":"#DIV/0!"}}]
["Kaphat?",{"$f":"IF(B15>0,1,0)","v":1}]
["Alap intenzitás",{"$f":"VLOOKUP(Tamogatastartalom!C39,Adatok!A12:B20,2,FALSE)","v":0.3}]
{"$rows_left_out":11}
{"sheet":"Adatok","index":3,"n_rows":25,"n_cols":21,"rows_kept":25,"cut":false,"hidden":true,"merged":[[9,0,9,11],[0,12,0,22],[4,3,8,3],[1,3,1,7],[2,5,2,7],[0,0,0,11],[1,9,1,11]]}
["Felárak",null,null,null,null,null,null,null,null,null,null,null,"Segédszámítások"]
[null,null,null,"Piaci referencia",null,null,null,null,null,"Refin kamatok",null,null,"Törlesztés",null,null,"Törlesztésgyakoriság",null,null,"Select",null,"Select"]
[null,null,null,null,null,"Fedezettség",null,null,null,null,null,null,"Egyenlő összeg",1,null,"Havi",12,null,"Beruházási hitel",null,"Beruházási hitel"]
[null,null,null,null,null,"Magas","Általános","Alacsony",null,"Min 1",{"$f":"refkam-3.5%","v":-3.5000000000000003E-2},null,"Egyenlő tőke",2,null,"Negyedéves",4,null,"Forgóeszközhitel",null,"Lízing"]
[null,null,null,"Hitelminősítés","Kiváló",60,75,100,null,"Min2",1E-3,null,"Egyedi",0,null,"Féléves",2,null,"Lízing"]
[null,null,null,null,"Jó",75,100,220,null,"Tényleges min",{"$f":"MAX(K4:K5)","v":1E-3}]
[null,null,null,null,"Kielégítő",100,220,400,null,"Max",{"$f":"refkammin+4%","v":4.1000000000000002E-2},null,"Annuitás"]
[null,null,null,null,"Gyenge",220,400,650]
[null,null,null,null,"Rossz",400,650,1000]
["Regionális támogatási intenzitások"]
[null,"Nagyvállalat",null,"Intenzitás","MAX Támogatástartalom (mio EUR)"]
["Select",0,null,0.5,37.5]
["Dél-Alföld",0.5,null,0.35,26.25,null,null,null,"ügyleti kamat","beruh","zöld beruh"]
["Dél-Dunántúl",0.5,null,0.3,22.5,null,null,null,"min",{"$f":"IF(Tamogatastartalom!C9=\"HUF\",0.035,0.01)","v":3.5000000000000003E-2},{"$f":"IF(Tamogatastartalom!C9=\"HUF\",0.025,0.005)","v":2.5000000000000001E-2}]
["Észak-Alföld",0.5,null,0.25,18.75,null,null,null,"max",{"$f":"IF(Tamogatastartalom!C9=\"HUF\",0.06,0.035)","v":0.06},{"$f":"IF(Tamogatastartalom!C9=\"HUF\",0.05,0.03)","v":0.05}]
{"$rows_left_out":10}